R4_Caseid_pub,R4_C_DURPROVVISIT_01_1,R4_C_NUMPROVCONT_03_1,R4_C_PROVUSE2009_03_1,R4_C_DURPROVVISIT_03_1,R4_C_NUMPROVCONT_04_1,R4_C_PROVUSE2009_04_1,R4_C_DURPROVVISIT_04_1,R4_C_NUMPROVCONT_05_1,R4_C_PROVUSE2009_05_1,R4_C_DURPROVVISIT_05_1,R4_C_NUMPROVCONT_07_1,R4_C_PROVUSE2009_07_1,R4_C_DURPROVVISIT_07_1,R4_C_NUMPROVCONT_10_1,R4_C_PROVUSE2009_10_1,R4_C_DURPROVVISIT_10_1,R4_C_NUMPROVCONT_10_2,R4_C_PROVUSE2009_10_2,R4_C_DURPROVVISIT_10_2,R4_C_NUMPROVCONT_10_3,R4_C_PROVUSE2009_10_3,R4_C_DURPROVVISIT_10_3,R4_C_NUMPROVCONT_11_1,R4_C_PROVUSE2009_11_1,R4_C_DURPROVVISIT_11_1,R4_C_NUMPROVCONT_12_1,R4_C_PROVUSE2009_12_1,R4_C_DURPROVVISIT_12_1
70004109,,,,,,,,,,,,,,,,,,,,,,,,,,,,
70005058,,,,,,,,,,,,,,,,,,,,,,,,,,,,
70000612,,,,,,,,,,,,,,,,,,,,,,,,,,,,
70002542,,24,2,1,,,,,,,,,,,,,,,,,,,,,,,,
70005196,,,,,,,,,,,,,,,,,,,,,,,,,,,,
70003431,,,,,,,,,,,,,,,,,,,,,,,,,,,,
70002769,,,,,,,,,,,,,,,,,,,,,,,,,,,,
70004497,,,,,,,,,,,,,,,,,,,,,,,,,,,,
70002689,,,,,,,,,,,,,,14,1,0.5,,,,,,,,,,,,
70005171,,,,,,,,,,,,,,,,,,,,,,,,,,,,
70005031,,,,,,,,,,,,,,4,1,0.25,,,,,,,,,,,,
70003386,,,,,,,,,,,,,,,,,,,,,,,,,,,,
70002662,,,,,,,,,,,,,,,,,,,,,,,,,,,,
70000795,,,,,,,,,,,,,,,,,,,,,,,,,,1,1,4
70000949,,144,1,1,,,,,,,,,,,,,,,,,,,,,,,,
70003895,,,,,,,,,,,,,,,,,,,,,,,,,,,,
70004771,,,,,,,,,,,,,,,,,,,,,,,,,,,,
70003061,,,,,,,,,,,,,,12,2,1,52.2,4,1,,,,,,,,,
70003879,,,,,,,,,,,,,,360,1,0.166666667,,,,,,,,,,,,
70003881,3,,,,,,,,,,,,,D,1,D,,,,,,,,,,,,
70001975,,,,,,,,,,,,,,52.2,1,1,,,,,,,,,,,,
70003792,,,,,,,,,,,,,,,,,,,,,,,,,,,,
70004705,,,,,,,,,,,,,,,,,,,,,,,,,,,,
70002400,,,,,,,,,,,,,,,,,,,,,,,,,,,,
70003228,,12,3,1,,,,,,,,,,,,,,,,,,,,,,,,
70000442,,,,,,,,,,,,,,,,,,,,,,,,,,,,
70002866,,,,,,,,,,,,,,24,1,0.5,,,,,,,,,,,,
70001077,,,,,,,,,,,,,,,,,,,,,,,,,,,,
70003809,,,,,,,,,,,,,,,,,,,,,,,,,,,,
70005080,,,,,,,,,,,,,,,,,,,,,,,,,,,,
70004786,,,,,,,,,,,,,,,,,,,,,,,,,,,,
70004471,,,,,,,,,,,,,,,,,,,,,,,,,,,,
70003091,,,,,,,,,,,,,,,,,,,,,,,,,,,,
70000608,,,,,,,,,,,,,,,,,,,,,,,,,,,,
70001840,,,,,,,,,,,,,,,,,,,,,,,,,,,,
70005108,,,,,,,,,,,,,,,,,,,,,,,,,,,,
70002033,,,,,,,,,,,,,,,,,,,,,,,,,,,,
70001291,,,,,,,,,,,,,,,,,,,,,,,,,,,,
70003583,,,,,,,,,,,,,,,,,,,,,,,,,,,,
70000150,,,,,,,,,,,,,,,,,,,,,,,,,,,,
70001904,,,,,,,,,,,,,,D,1,D,,,,,,,,,,,,
70005335,,,,,,,,,,,,,,,,,,,,,,,,,,,,
70000683,,,,,,,,,,,,,,6,1,0.5,,,,,,,,,,,,
70001288,,,,,,,,,,,,,,,,,,,,,,,,,,,,
70000687,,,,,,,,,,,,,,52.2,1,1,,,,,,,,,,,,
70001969,,,,,,,,,,,,,,,,,,,,,,,,,,,,
70004045,,6,1,1,,,,104.4,1,3,,,,,,,,,,,,,,,,,,
70004123,,,,,,,,,,,,,,D,1,5,,,,,,,,,,,,
70001395,,,,,,,,,,,,,,,,,,,,,,,,,,,,
70003737,,,,,,,,,,,,,,4,1,0.333333333,52.2,1,0.333333333,,,,,,,,,
70004103,,,,,,,,,,,,,,,,,,,,,,,,,,,,
70003082,,,,,,,,,,,,,,,,,,,,,,,,,,,,
70001020,,,,,,,,,,,,,,,,,,,,,,,,,,,,
70003407,1,,,,,,,,,,,,,,,,,,,,,,,,,52.2,1,1
70004258,,,,,,,,,,,,,,,,,,,,,,,,,,,,
70000634,,,,,,,,,,,,,,,,,,,,,,,,,,,,
70005369,,,,,,,,,,,,,,,,,,,,,,,,,,,,
70003476,,,,,,,,,,,,,,,,,,,,,,,,,,,,
70003880,,,,,,,,,,,,,,4,1,0.75,,,,,,,,,,,,
70003554,,,,,,,,,,,,,,4,1,0.25,,,,,,,,,,,,
70002876,,,,,,,,,,,,,,,,,,,,,,,,,,,,
70004911,,,,,,,,,,,,,,,,,,,,,,,,,,,,
70000296,,,,,,,,,,,,,,,,,,,,,,,,,,,,
70003931,,,,,,,,,,,,,,,,,,,,,,,,,,,,
70001233,,,,,,,,,,,,,,,,,,,,,,,,,,,,
70000880,,,,,,,,,,,,,,,,,,,,,,,,,,,,
70001460,,,,,,,,,,,,,,,,,,,,,,,,,,,,
70003721,,,,,,,,,,,,,,,,,,,,,,,,,,,,
70003944,,,,,,,,,,,,,,5,1,3,1,1,2,,,,,,,2,1,0.5
70004586,,,,,,,,,,,,,,,,,,,,,,,,,,1,1,0.5
70000280,,,,,,,,,,,,,,,,,,,,,,,,,,,,
70003261,,,,,,,,,,,,,,52.2,1,D,,,,,,,,,,,,
70002531,,,,,,,,,,,,,,25,1,0.333333333,,,,,,,,,,,,
70001126,,,,,,,,,,,,,,,,,,,,,,,,,,,,
70005362,,,,,,,,,,,,,,,,,,,,,,,,,,,,
70004086,,,,,,,,,,,,,,12,1,1,,,,,,,,,,,,
70000774,,,,,,,,,,,,,,,,,,,,,,,,,,,,
70004295,,,,,,,,,,,,,,,,,,,,,,,,,,,,
70001112,,,,,,,,,,,,,,,,,,,,,,,,,,,,
70003211,,,,,,,,,,,,,,156.6,1,2,,,,,,,,,,,,
70001027,,,,,,,,,,,,,,,,,,,,,,,,,,,,
70004219,,,,,,,,,,,,,,12,2,1,,,,,,,,,,,,
70001060,,7,1,5,,,,,,,,,,6,1,3,D,D,D,,,,,,,,,
70000664,,,,,,,,,,,,,,,,,,,,,,,,,,,,
70001761,,,,,,,,,,,,,,12,1,0.333333333,12,2,0.5,,,,,,,,,
70004624,,,,,,,,,,,,,,,,,,,,,,,,,,,,
70000026,,,,,,,,,,,,,,,,,,,,,,,,,,,,
70004611,,,,,,,,,,,,,,2,2,1,,,,,,,,,,,,
70002937,,,,,,,,,,,,,,4,4,0.583333333,3,1,1,1,1,8,,,,,,
70000892,,,,,,,,,,,,,,,,,,,,,,,,,,,,
70003892,,,,,,,,,,,,,,360,1,0.5,,,,,,,,,,,,
70000898,,,,,,,,,,,,,,,,,,,,,,,,,,,,
70001879,,,,,,,,,,,,,,12,1,0.5,2,1,1,,,,,,,,,
70004731,,104.4,1,1,,,,,,,,,,,,,,,,,,,,,,,,
70001308,,,,,,,,12,D,D,360,4,8,12,1,0.5,,,,,,,,,,,,
70001829,,,,,,,,,,,,,,,,,,,,,,,,,,,,
70000398,,,,,,,,,,,,,,,,,,,,,,,,,,,,
70002228,,,,,,,,,,,,,,,,,,,,,,,,,,,,
70000656,,,,,,,,,,,,,,52.2,1,0.166666667,,,,,,,,,,,,
70005089,,,,,,,,,,,,,,2,1,56,,,,,,,,,,,,
70002627,,,,,,,,,,,,,,,,,,,,,,,,,,,,
70000264,,,,,,,,,,,,,,12,2,1,,,,,,,,,,,,
70003323,,,,,,,,,,,,,,,,,,,,,,,,,,,,
70001655,,,,,,,,,,,,,,,,,,,,,,,,,,,,
70000809,,,,,,,,,,,,,,,,,,,,,,,,,,,,
70003496,,,,,,,,,,,,,,,,,,,,,,,,,,,,
70002426,,,,,,,,,,,,,,,,,,,,,,,,,,,,
70002248,,,,,,,,,,,,,,,,,,,,,,,,,,,,
70003652,,,,,,,,,,,,,,,,,,,,,,,,,,,,
70003416,,,,,,,,,,,,,,,,,,,,,,,,,,,,
70005404,,,,,,,,,,,,,,,,,,,,,,,,,,,,
70005068,,,,,,,,,,,,,,13,1,1,2,1,1.5,,,,,,,,,
70003946,,,,,,,,,,,,,,,,,,,,,,,,,,,,
70004589,,,,,261,1,5,,,,,,,4,1,1,,,,,,,,,,,,
70003014,,,,,,,,,,,,,,,,,,,,,,,,,,,,
70002444,,,,,,,,,,,,,,,,,,,,,,,,,,,,
70002328,,,,,,,,,,,,,,,,,,,,,,,,,,,,
70000913,,,,,,,,,,,,,,,,,,,,,,,,,,,,
70003132,,,,,,,,,,,,,,,,,,,,,,,,,,,,
70004221,,,,,,,,,,,,,,,,,,,,,,,,,,,,
70003993,,,,,,,,,,,,,,,,,,,,,,,,,,,,
70003424,,,,,,,,,,,,,,,,,,,,,,,52.2,1,1,,,
70003153,,,,,,,,,,,,,,,,,,,,,,,,,,,,
70001728,,,,,,,,,,,,,,,,,,,,,,,,,,,,
70000559,,,,,,,,,,,,,,,,,,,,,,,,,,,,
70000214,,,,,,,,,,,,,,,,,,,,,,,,,,,,
70004884,,,,,,,,,,,,,,,,,,,,,,,,,,,,
70001891,,,,,,,,,,,,,,,,,,,,,,,,,,,,
70001738,,,,,,,,,,,,,,,,,,,,,,,,,,,,
70001541,,52.2,2,0.833333333,,,,,,,,,,,,,,,,,,,,,,,,
70004670,,,,,,,,,,,,,,5,2,1,,,,,,,,,,,,
70002590,,,,,,,,,,,,,,4,1,1,1,1,1,,,,156,1,3,,,
70001011,,,,,,,,,,,,,,,,,,,,,,,,,,,,
70000527,,,,,,,,,,,,,,,,,,,,,,,,,,,,
70003130,,,,,,,,,,,,,,60,1,1,,,,,,,,,,,,
70000282,,,,,,,,,,,,,,,,,,,,,,,,,,,,
70004892,,24,1,0.5,,,,,,,,,,,,,,,,,,,,,,,,
70000293,,,,,,,,,,,,,,3,2,0.083333333,,,,,,,,,,,,
70002945,,,,,,,,,,,,,,156.6,2,0.25,,,,,,,,,,,,
70004664,,,,,,,,,,,,,,,,,,,,,,,,,,,,
70004546,,,,,,,,,,,,,,,,,,,,,,,,,,,,
70003841,,48,1,2,,,,,,,,,,24,2,1,36,2,2,,,,,,,,,
70000201,,,,,,,,,,,,,,,,,,,,,,,,,,,,
70003949,,5,1,1,,,,,,,,,,,,,,,,,,,,,,,,
70003821,,,,,,,,,,,,,,,,,,,,,,,,,,,,
70003568,,,,,,,,,,,,,,,,,,,,,,,,,,,,
70003160,,,,,,,,,,,,,,,,,,,,,,,,,,,,
70002304,,,,,,,,,,,,,,60,1,1,,,,,,,,,,,,
70004775,,,,,,,,,,,,,,,,,,,,,,,52.2,1,1,,,
70005293,,,,,,,,,,,,,,,,,,,,,,,,,,,,
70004501,,,,,,,,,,,,,,24,1,0.5,,,,,,,156,1,1,,,
70001498,,,,,,,,,,,,,,,,,,,,,,,,,,,,
70002053,,,,,,,,,,,,,,,,,,,,,,,,,,,,
70003611,,,,,,,,,,,,,,,,,,,,,,,,,,,,
70001071,,,,,,,,,,,,,,,,,,,,,,,,,,,,
70001770,,,,,,,,,,,,,,,,,,,,,,,,,,,,
70002533,,,,,,,,,,,,,,,,,,,,,,,,,,,,
70004860,,,,,,,,,,,,,,,,,,,,,,,,,,,,
70000147,,,,,,,,,,,,,,30,1,1.5,10,1,1.5,,,,,,,,,
70004643,,,,,,,,,,,,,,,,,,,,,,,,,,,,
70003349,,,,,,,,,,,,,,,,,,,,,,,,,,,,
70005118,,,,,,,,,,,,,,3,1,0.583333333,2,1,0.25,2,1,8,,,,,,
70002463,0.5,,,,,,,,,,,,,,,,,,,,,,,,,,,
70000723,,,,,,,,,,,,,,,,,,,,,,,,,,,,
70000097,,,,,,,,,,,,,,,,,,,,,,,,,,,,
70000079,,,,,,,,,,,,,,,,,,,,,,,,,,,,
70003784,,,,,,,,,,,,,,,,,,,,,,,,,,,,
70002918,,,,,,,,,,,,,,,,,,,,,,,,,,,,
70004275,,,,,,,,,,,,,,,,,,,,,,,,,,,,
70000545,,,,,,,,,,,,,,,,,,,,,,,,,,,,
70005358,,,,,,,,,,,,,,,,,,,,,,,,,,,,
70004997,,52.2,2,1,,,,,,,,,,,,,,,,,,,,,,,,
70004810,,,,,,,,,,,,,,,,,,,,,,,,,,,,
70002864,,,,,,,,,,,,,,,,,,,,,,,,,,,,
70001309,,,,,,,,,,,,,,,,,,,,,,,,,,,,
70005231,,,,,,,,,,,,,,,,,,,,,,,,,,,,
70002886,,,,,,,,,,,,,,,,,,,,,,,,,,,,
70000035,,,,,,,,,,,,,,,,,,,,,,,,,,,,
70004162,,,,,,,,,,,,,,,,,,,,,,,,,,,,
70003679,,,,,,,,,,,,,,,,,,,,,,,,,,,,
70003450,,,,,,,,,,,,,,,,,,,,,,,,,,,,
70000765,,,,,,,,,,,,,,,,,,,,,,,,,,,,
70001393,,,,,,,,,,,,,,1,1,96,,,,,,,,,,,,
70002867,,,,,,,,,,,,,,,,,,,,,,,,,,,,
70002096,,,,,,,,,,,,,,4,2,1,,,,,,,,,,25,1,100
70004095,,104.4,1,0.5,,,,,,,,,,,,,,,,,,,,,,,,
70003682,,,,,,,,,,,,,,261,1,1,,,,,,,,,,,,
70000702,,,,,,,,,,,,,,,,,,,,,,,,,,,,
70001581,,,,,,,,,,,6,1,1,,,,,,,,,,,,,,,
70000358,,,,,,,,,,,,,,,,,,,,,,,,,,,,
70003641,,,,,,,,360,1,16,,,,,,,,,,,,,,,,,,
70001344,,,,,,,,,,,,,,,,,,,,,,,,,,,,
70004407,,8,2,0.75,,,,,,,,,,,,,,,,,,,,,,2,3,0.333333333
70000786,,,,,,,,,,,,,,4,2,0.666666667,,,,,,,,,,,,
70004186,,72,2,1,,,,,,,,,,,,,,,,,,,,,,,,
70003361,,,,,,,,,,,,,,,,,,,,,,,,,,,,
70001090,,,,,,,,,,,,,,,,,,,,,,,,,,,,
70001113,,,,,,,,,,,,,,,,,,,,,,,,,,,,
70002293,,,,,,,,,,,,,,,,,,,,,,,,,,,,
70005163,,,,,,,,,,,,,,R,2,2,30,2,40,,,,,,,,,
70002980,,,,,,,,,,,,,,,,,,,,,,,,,,,,
70005400,,,,,,,,,,,,,,,,,,,,,,,,,,,,
70002845,,,,,,,,,,,,,,,,,,,,,,,,,,,,
70003503,,,,,,,,,,,,,,3,1,1,3,1,0.75,3,1,0.5,,,,,,
70000274,,24,1,20,,,,,,,,,,,,,,,,,,,1,1,5,,,
70003298,,,,,,,,,,,,,,,,,,,,,,,,,,,,
70004223,,,,,,,,,,,,,,3,4,1,,,,,,,,,,,,
70001948,,,,,261,1,8,,,,,,,,,,,,,,,,,,,,,
70000370,,,,,,,,,,,,,,,,,,,,,,,,,,,,
70000498,,,,,,,,,,,,,,,,,,,,,,,,,,,,
70005289,,,,,,,,,,,,,,,,,,,,,,,,,,,,
70002607,4,,,,,,,,,,,,,,,,,,,,,,,,,,,
70002435,,,,,,,,,,,,,,,,,,,,,,,,,,,,
70002859,0.5,,,,12,3,4,261,2,5,,,,,,,,,,,,,,,,,,
70005288,,12,1,0.333333333,,,,,,,,,,12,1,0.333333333,,,,,,,,,,,,
70003976,,,,,,,,,,,,,,,,,,,,,,,,,,,,
70001450,,,,,,,,,,,,,,,,,,,,,,,,,,32,1,8
70002078,,,,,,,,,,,,,,,,,,,,,,,,,,,,
70004081,,,,,,,,,,,,,,,,,,,,,,,,,,,,
70003697,,,,,,,,,,,,,,,,,,,,,,,,,,,,
70004195,,,,,,,,,,,,,,144,2,2,,,,,,,,,,,,
70005382,,4,1,1,,,,,,,,,,D,1,1,,,,,,,,,,,,
70003477,,,,,,,,360,1,20,,,,24,1,0.333333333,,,,,,,,,,,,
70004926,,,,,,,,,,,,,,,,,,,,,,,,,,,,
70005032,,,,,,,,,,,,,,,,,,,,,,,,,,,,
70002413,,,,,,,,,,,,,,,,,,,,,,,,,,,,
70002298,,,,,,,,,,,,,,3,2,1,,,,,,,,,,,,
70002160,,,,,,,,,,,,,,24,2,1,20,1,50,12,2,1,,,,,,
70003820,,,,,,,,,,,,,,10,2,0.5,,,,,,,,,,,,
70000790,,,,,,,,,,,,,,,,,,,,,,,,,,,,
70000387,,,,,,,,,,,,,,,,,,,,,,,,,,,,
70000958,,,,,,,,,,,208.8,1,4,,,,,,,,,,,,,,,
70004993,,,,,,,,,,,,,,,,,,,,,,,,,,,,
70004450,,,,,,,,,,,,,,,,,,,,,,,,,,,,
70000299,,,,,,,,,,,,,,,,,,,,,,,,,,,,
70000991,,,,,,,,,,,,,,12,1,0.25,,,,,,,,,,,,
70003914,,,,,,,,,,,,,,,,,,,,,,,,,,20,2,1
70003797,,,,,,,,,,,,,,,,,,,,,,,,,,,,
70002817,,,,,,,,,,,,,,,,,,,,,,,,,,,,
70000761,,,,,,,,,,,,,,,,,,,,,,,,,,,,
70002655,,,,,,,,,,,,,,,,,,,,,,,,,,,,
70000082,,,,,,,,,,,,,,,,,,,,,,,,,,,,
70000743,,,,,,,,,,,,,,,,,,,,,,,,,,,,
70003507,,,,,,,,,,,,,,,,,,,,,,,,,,,,
70002110,,,,,,,,,,,,,,20,1,1,20,1,1,,,,20,4,1.5,,,
70001388,,,,,,,,,,,,,,,,,,,,,,,,,,,,
70004673,,,,,,,,,,,,,,,,,,,,,,,,,,,,
70005101,,,,,,,,,,,,,,,,,,,,,,,,,,,,
70003539,,,,,,,,,,,,,,,,,,,,,,,,,,,,
70004953,,,,,,,,,,,,,,,,,,,,,,,,,,,,
70001151,,,,,,,,,,,,,,,,,,,,,,,,,,,,
70004420,,,,,,,,,,,,,,,,,,,,,,,,,,,,
70002512,,4,1,1,,,,,,,,,,,,,,,,,,,,,,,,
70003998,,,,,,,,,,,,,,,,,,,,,,,,,,,,
70003199,,52.2,2,0.5,,,,,,,,,,,,,,,,,,,,,,,,
70000403,,,,,,,,,,,,,,,,,,,,,,,,,,,,
70004904,,,,,,,,,,,,,,,,,,,,,,,,,,,,
70004757,,4,1,0.75,,,,,,,,,,,,,,,,,,,,,,,,
70005199,,,,,,,,,,,,,,156.6,1,3,,,,,,,,,,,,
70004995,,,,,,,,,,,261,1,1,,,,,,,,,,,,,,,
70005361,,,,,,,,,,,,,,,,,,,,,,,,,,,,
70004676,,,,,,,,,,,,,,24,1,0.75,,,,,,,,,,,,
70003951,,,,,,,,,,,12,2,1,,,,,,,,,,,,,,,
70001730,,,,,,,,,,,,,,4,1,1,47,2,1,3,2,2,,,,,,
70004940,,,,,,,,,,,,,,10,2,D,D,3,D,,,,,,,,,
70003617,,,,,,,,,,,,,,,,,,,,,,,,,,,,
70000339,,,,,,,,,,,,,,,,,,,,,,,,,,,,
70003324,,,,,,,,,,,,,,,,,,,,,,,,,,,,
70000238,,,,,,,,,,,,,,,,,,,,,,,,,,,,
70001557,,,,,,,,,,,,,,,,,,,,,,,,,,,,
70004778,,,,,,,,,,,,,,,,,,,,,,,,,,,,
70002582,,12,2,1,,,,,,,,,,,,,,,,,,,,,,,,
70002897,,,,,,,,,,,,,,2,1,1,3,1,1,4,1,1.5,,,,,,
70005303,,,,,,,,,,,,,,2,2,0.5,,,,,,,,,,,,
70002556,,,,,,,,,,,,,,,,,,,,,,,,,,,,
70003438,,,,,,,,,,,,,,,,,,,,,,,,,,,,
70002792,,,,,,,,,,,,,,104.4,1,1,24,1,1,,,,,,,,,
70003242,,,,,,,,,,,,,,,,,,,,,,,,,,,,
70003781,,,,,,,,,,,,,,12,1,0.5,,,,,,,,,,,,
70002244,,12,2,1,,,,,,,,,,,,,,,,,,,,,,,,
70001399,,,,,,,,,,,,,,,,,,,,,,,,,,,,
70002196,,,,,,,,,,,,,,,,,,,,,,,,,,,,
70004999,,12,1,D,1,2,1,,,,,,,,,,,,,,,,,,,,,
70004423,,12,2,1,,,,,,,360,2,3,,,,,,,,,,,,,,,
70005226,,,,,,,,,,,12,1,8,24,1,2,,,,,,,,,,12,2,1
70002754,,,,,,,,,,,,,,,,,,,,,,,,,,,,
70001556,,,,,,,,,,,,,,3,4,0.5,,,,,,,,,,,,
70000050,,,,,,,,,,,,,,,,,,,,,,,,,,,,
70004061,D,,,,,,,,,,,,,24,1,0.75,,,,,,,,,,,,
70001714,,,,,,,,24,2,0.25,,,,12,1,1,6,1,0.25,,,,,,,208.8,1,1
70001625,,,,,,,,,,,,,,,,,,,,,,,,,,,,
70001015,,,,,,,,,,,,,,4,1,200,1,1,0.75,1,1,8,,,,,,
70004182,,,,,,,,,,,,,,,,,,,,,,,,,,,,
70001275,,,,,,,,,,,,,,,,,,,,,,,,,,,,
70001735,,,,,,,,,,,261,1,5,,,,,,,,,,12,1,0.5,,,
70004029,,,,,,,,,,,,,,4,1,136,,,,,,,,,,2,1,0.5
70002188,,,,,,,,,,,,,,,,,,,,,,,,,,,,
70004326,,,,,,,,,,,,,,12,1,0.75,,,,,,,,,,,,
70001942,,,,,,,,,,,,,,,,,,,,,,,,,,,,
70003400,,8,1,0.5,,,,,,,,,,6,1,4,10,1,0.5,10,1,0.75,,,,,,
70002431,,,,,,,,,,,,,,,,,,,,,,,,,,,,
70000857,,,,,,,,,,,,,,,,,,,,,,,,,,,,
70004877,,12,1,0.25,,,,,,,,,,,,,,,,,,,,,,,,
70001169,,,,,,,,,,,,,,,,,,,,,,,,,,,,
70003936,,,,,,,,,,,261,1,6,,,,,,,,,,20,1,2,360,1,7
70000884,0.5,,,,,,,,,,208.8,1,2,10,1,1,,,,,,,,,,52.2,1,1
70004839,,,,,,,,,,,,,,,,,,,,,,,,,,,,
70004543,,,,,,,,,,,,,,,,,,,,,,,,,,,,
70001279,,,,,,,,,,,,,,,,,,,,,,,,,,,,
70002966,,,,,,,,,,,,,,,,,,,,,,,,,,,,
70001889,,,,,,,,,,,,,,,,,,,,,,,,,,,,
70005268,,,,,,,,,,,,,,,,,,,,,,,,,,,,
70004610,,,,,,,,,,,,,,,,,,,,,,,,,,,,
70004906,,,,,,,,,,,,,,,,,,,,,,,,,,,,
70005401,,50,1,2,,,,,,,,,,3,1,48,,,,,,,,,,,,
70000767,,,,,,,,,,,,,,360,1,0.5,,,,,,,,,,,,
70004108,,,,,,,,,,,,,,,,,,,,,,,,,,,,
70004199,,,,,,,,,,,,,,,,,,,,,,,,,,,,
70001114,,,,,,,,,,,,,,,,,,,,,,,,,,,,
70004279,,,,,,,,,,,,,,,,,,,,,,,,,,208.8,1,0.5
70002924,,104.4,1,6,,,,,,,,,,,,,,,,,,,,,,,,
70000389,,,,,,,,,,,,,,,,,,,,,,,,,,,,
70001887,,,,,,,,,,,,,,,,,,,,,,,,,,,,
70001966,,,,,,,,,,,,,,,,,,,,,,,,,,,,
70000594,,,,,,,,,,,,,,,,,,,,,,,,,,,,
70003763,,208.8,1,6,,,,,,,,,,,,,,,,,,,,,,,,
70005340,,,,,,,,,,,,,,,,,,,,,,,,,,,,
70002930,,,,,,,,,,,,,,,,,,,,,,,,,,,,
70000982,,4,1,0.75,,,,,,,,,,4,3,0.25,1,3,2,,,,,,,,,
70000838,,,,,,,,,,,,,,,,,,,,,,,,,,,,
70002693,,,,,,,,,,,,,,,,,,,,,,,,,,,,
70000254,,,,,,,,,,,,,,,,,,,,,,,,,,,,
70005398,,,,,,,,,,,,,,,,,,,,,,,,,,,,
70004327,,,,,,,,,,,,,,,,,,,,,,,,,,,,
70001716,,,,,,,,,,,,,,,,,,,,,,,,,,,,
70004959,,,,,,,,,,,,,,,,,,,,,,,,,,,,
70004677,,,,,,,,,,,,,,,,,,,,,,,,,,,,
70002500,,,,,,,,,,,,,,,,,,,,,,,,,,,,
70005028,,,,,,,,,,,,,,,,,,,,,,,,,,,,
70001191,1,,,,,,,,,,,,,,,,,,,,,,,,,24,2,1
70001383,,,,,,,,,,,,,,,,,,,,,,,,,,,,
70004559,,,,,,,,,,,,,,,,,,,,,,,,,,,,
70001241,,,,,,,,,,,,,,170,1,0.5,4,1,0.5,,,,,,,,,
70000104,,,,,D,1,D,104.4,3,4,,,,,,,,,,,,,,,,12,1,D
70003044,,,,,,,,,,,,,,24,1,1,,,,,,,,,,,,
70002363,,,,,,,,,,,,,,1,2,1,,,,,,,,,,,,
70005297,,,,,,,,,,,,,,,,,,,,,,,,,,,,
70004333,,,,,,,,,,,,,,4,1,0.333333333,2,1,0.166666667,,,,,,,,,
70004019,,,,,,,,,,,,,,,,,,,,,,,,,,,,
70003753,,,,,,,,,,,,,,,,,,,,,,,,,,,,
70002608,,,,,,,,,,,,,,52.2,4,0.75,,,,,,,,,,,,
70001707,,24,1,1,,,,,,,,,,,,,,,,,,,,,,,,
70003655,,,,,,,,,,,,,,D,2,0.75,,,,,,,,,,,,
70003549,,,,,,,,,,,,,,48,1,1,,,,,,,,,,,,
70000183,,3,1,0.75,,,,,,,,,,,,,,,,,,,,,,24,1,0.083333333
70004937,,,,,,,,,,,,,,4,2,0.5,1,2,0.666666667,5,2,0.333333333,,,,,,
70000933,,,,,,,,,,,,,,,,,,,,,,,,,,,,
70002229,,,,,,,,,,,,,,,,,,,,,,,,,,,,
70005212,,,,,,,,,,,,,,,,,,,,,,,,,,,,
70000780,,,,,,,,,,,,,,,,,,,,,,,,,,,,
70003266,,,,,,,,,,,,,,,,,,,,,,,,,,,,
70000825,,,,,,,,,,,,,,,,,,,,,,,,,,,,
70000404,,,,,,,,,,,,,,,,,,,,,,,,,,,,
70000588,,,,,,,,,,,,,,,,,,,,,,,,,,,,
70004850,,,,,,,,,,,,,,,,,,,,,,,,,,,,
70004929,,,,,,,,,,,,,,,,,,,,,,,,,,,,
70003319,,,,,,,,,,,,,,5,1,32,25,1,0.383333333,,,,,,,,,
70003364,,,,,,,,,,,,,,1,3,1,,,,,,,,,,,,
70003574,,,,,,,,,,,,,,,,,,,,,,,,,,,,
70001051,,,,,,,,,,,,,,,,,,,,,,,,,,,,
70001927,,,,,,,,,,,,,,,,,,,,,,,,,,,,
70001072,,,,,,,,,,,,,,,,,,,,,,,,,,,,
70001214,,,,,,,,,,,,,,8,2,0.25,10,1,2,,,,,,,,,
70002522,,,,,,,,,,,,,,,,,,,,,,,,,,,,
70001394,,,,,,,,,,,,,,,,,,,,,,,,,,,,
70004473,,,,,,,,,,,,,,,,,,,,,,,,,,,,
70004349,,,,,,,,,,,,,,,,,,,,,,,,,,,,
70005045,,,,,,,,,,,,,,,,,,,,,,,,,,,,
70004815,,,,,,,,,,,,,,,,,,,,,,,,,,,,
70004164,,,,,,,,,,,,,,,,,,,,,,,,,,,,
70004565,,,,,,,,,,,,,,,,,,,,,,,,,,,,
70001209,,,,,,,,,,,,,,,,,,,,,,,,,,2,2,2
70004587,D,4,2,1,,,,,,,,,,D,2,D,,,,,,,,,,,,
70000680,,,,,,,,,,,,,,,,,,,,,,,,,,52.2,1,0.5
70002739,,,,,,,,,,,,,,,,,,,,,,,,,,,,
70001390,,,,,,,,,,,,,,,,,,,,,,,,,,,,
70002109,,,,,,,,,,,,,,104.4,1,0.75,,,,,,,,,,,,
70003155,,,,,,,,,,,,,,,,,,,,,,,,,,,,
70000216,,,,,,,,,,,,,,,,,,,,,,,,,,,,
70000471,,12,1,0.5,,,,,,,,,,,,,,,,,,,,,,,,
70004984,,,,,,,,,,,,,,,,,,,,,,,,,,,,
70002118,,,,,,,,,,,,,,10,1,0.5,,,,,,,,,,,,
70001106,,,,,,,,,,,,,,,,,,,,,,,,,,,,
70003220,,,,,,,,,,,,,,156.6,2,24,24,3,0.25,,,,,,,156.6,1,1
70000584,,,,,,,,,,,,,,10,1,200,36,1,1,52.2,1,1.5,,,,,,
70001338,,,,,,,,,,,,,,,,,,,,,,,,,,,,
70004633,,,,,,,,,,,,,,24,1,0.5,,,,,,,,,,,,
70000595,,,,,,,,,,,,,,,,,,,,,,,,,,,,
70002997,,,,,,,,,,,,,,,,,,,,,,,,,,,,
70001033,,,,,,,,,,,,,,12,1,2,1,2,0.083333333,1,2,8,,,,,,
70005387,,,,,,,,,,,,,,,,,,,,,,,,,,,,
70001753,,,,,,,,,,,,,,,,,,,,,,,,,,,,
70004608,0.5,,,,,,,,,,,,,,,,,,,,,,,,,360,1,1
70002676,,,,,,,,,,,,,,,,,,,,,,,,,,,,
70003162,,,,,,,,,,,,,,,,,,,,,,,,,,,,
70004986,,,,,,,,,,,,,,,,,,,,,,,,,,,,
70003455,,,,,,,,,,,,,,,,,,,,,,,,,,,,
70005377,,,,,,,,,,,,,,,,,,,,,,,,,,156.6,1,2
70004463,,,,,,,,,,,,,,12,1,0.5,,,,,,,,,,,,
70000159,,,,,,,,,,,,,,,,,,,,,,,,,,,,
70005326,,,,,,,,,,,,,,,,,,,,,,,,,,,,
70004174,,,,,,,,,,,,,,,,,,,,,,,,,,,,
70001778,,,,,,,,,,,,,,,,,,,,,,,,,,,,
70000941,,,,,,,,,,,,,,,,,,,,,,,,,,,,
70000939,,,,,,,,12,4,D,,,,,,,,,,,,,,,,,,
70002940,,,,,,,,,,,,,,,,,,,,,,,,,,,,
70004818,,,,,,,,,,,,,,1,1,1,5,1,1,2,1,8,2,2,4,,,
70000305,,,,,,,,,,,,,,,,,,,,,,,,,,,,
70002722,,1,1,1,1,1,1,,,,,,,,,,,,,,,,,,,,,
70004218,,,,,,,,,,,,,,,,,,,,,,,,,,,,
70002835,,,,,,,,,,,,,,,,,,,,,,,,,,,,
70004089,,,,,,,,,,,,,,,,,,,,,,,,,,,,
70002889,,,,,,,,,,,,,,12,1,0.5,,,,,,,,,,5,2,2
70000046,,,,,,,,,,,,,,,,,,,,,,,,,,,,
70004910,,,,,,,,,,,,,,,,,,,,,,,,,,,,
70000392,,,,,,,,,,,,,,,,,,,,,,,,,,,,
70001517,,,,,,,,,,,,,,,,,,,,,,,,,,,,
70002831,,1,1,20,,,,,,,,,,,,,,,,,,,,,,,,
70004513,,12,2,1,261,1,8,,,,,,,,,,,,,,,,,,,,,
70001306,,,,,,,,,,,,,,,,,,,,,,,,,,,,
70004914,,,,,,,,,,,,,,,,,,,,,,,,,,,,
70001475,,,,,12,1,1,,,,,,,,,,,,,,,,,,,,,
70002014,,,,,,,,,,,,,,104.4,1,2,4,1,0.5,2,2,0.5,,,,,,
70000599,,,,,,,,,,,,,,11,1,D,,,,,,,,,,,,
70005087,,,,,,,,,,,,,,,,,,,,,,,,,,,,
70000981,,,,,,,,,,,,,,2,4,0.333333333,,,,,,,,,,,,
70003837,,,,,,,,,,,,,,,,,,,,,,,,,,,,
70000636,,,,,,,,,,,,,,52.2,2,1,1,4,0.75,5,2,1,,,,,,
70004994,,,,,,,,,,,,,,,,,,,,,,,,,,,,
70002998,,,,,,,,,,,,,,,,,,,,,,,,,,,,
70005359,,,,,,,,,,,,,,12,1,0.75,,,,,,,,,,,,
70001964,,,,,,,,,,,,,,,,,,,,,,,,,,,,
70000557,,,,,,,,,,,,,,,,,,,,,,,,,,,,
70000736,,,,,,,,,,,,,,24,1,0.416666667,,,,,,,,,,,,
70003720,,,,,,,,,,,,,,,,,,,,,,,,,,,,
70003269,,48,1,0.75,,,,,,,,,,,,,,,,,,,,,,,,
70004840,,,,,,,,,,,,,,,,,,,,,,,,,,,,
70001131,,,,,,,,,,,,,,,,,,,,,,,,,,,,
70000699,,,,,,,,,,,,,,,,,,,,,,,,,,,,
70000863,,,,,,,,,,,,,,,,,,,,,,,,,,,,
70004037,,,,,,,,,,,,,,,,,,,,,,,,,,,,
70004816,,,,,,,,,,,,,,12,1,0.333333333,,,,,,,,,,,,
70001644,,,,,,,,,,,,,,,,,,,,,,,,,,,,
70003422,,,,,,,,,,,,,,20,2,0.75,,,,,,,,,,,,
70002156,,,,,,,,,,,,,,,,,,,,,,,,,,,,
70000011,,,,,,,,,,,,,,,,,,,,,,,,,,,,
70004770,,,,,,,,,,,,,,3,1,0.5,,,,,,,,,,,,
70001326,,,,,,,,,,,,,,,,,,,,,,,,,,,,
70003297,,,,,,,,,,,,,,12,2,0.5,,,,,,,,,,24,2,1
70000551,,,,,,,,,,,,,,,,,,,,,,,,,,,,
70000783,,,,,,,,4,2,1,,,,,,,,,,,,,,,,,,
70003849,,,,,,,,,,,,,,,,,,,,,,,,,,,,
70002814,,,,,,,,,,,,,,6,4,0.75,24,1,0.75,,,,,,,,,
70002854,,,,,,,,,,,,,,,,,,,,,,,104.4,1,1,,,
70000597,,,,,,,,,,,,,,,,,,,,,,,,,,,,
70000465,,,,,,,,,,,,,,D,1,0.5,,,,,,,,,,,,
70002947,,,,,,,,,,,,,,,,,,,,,,,,,,,,
70005195,,,,,,,,,,,,,,104.4,1,1.5,,,,,,,,,,,,
70003754,,,,,,,,,,,,,,,,,,,,,,,,,,,,
70003770,,,,,,,,,,,,,,4,1,0.5,,,,,,,,,,,,
70003062,,,,,,,,,,,,,,,,,,,,,,,,,,,,
70002740,,,,,,,,,,,,,,,,,,,,,,,,,,,,
70000199,,,,,,,,,,,,,,,,,,,,,,,,,,,,
70000804,,,,,,,,,,,,,,,,,,,,,,,,,,,,
70005343,,,,,D,1,1,261,1,D,,,,12,1,0.5,,,,,,,,,,,,
70000033,,,,,,,,,,,,,,,,,,,,,,,,,,,,
70001740,,,,,,,,,,,,,,,,,,,,,,,,,,,,
70001251,,,,,,,,,,,,,,8,2,1,,,,,,,,,,,,
70004772,,,,,,,,,,,,,,,,,,,,,,,,,,,,
70001791,,1,2,20,,,,,,,,,,36,1,0.75,,,,,,,,,,,,
70005014,,,,,,,,,,,,,,,,,,,,,,,,,,,,
70004603,,,,,,,,,,,,,,,,,,,,,,,,,,,,
70003274,,,,,,,,,,,,,,,,,,,,,,,,,,,,
70000233,,,,,,,,,,,,,,,,,,,,,,,,,,,,
70001242,,,,,,,,,,,,,,,,,,,,,,,,,,,,
70000447,,,,,,,,,,,,,,,,,,,,,,,,,,,,
70005274,,,,,,,,,,,,,,,,,,,,,,,,,,,,
70004859,,,,,,,,,,,,,,208.8,1,D,,,,,,,,,,,,
70002498,,,,,,,,,,,,,,,,,,,,,,,,,,,,
70003333,,,,,,,,24,2,20,,,,,,,,,,,,,,,,,,
70000441,,,,,52.2,2,0.333333333,,,,,,,,,,,,,,,,,,,,,
70000916,,,,,,,,,,,,,,,,,,,,,,,,,,,,
70002459,,,,,,,,,,,,,,,,,,,,,,,,,,,,
70001405,,12,3,0.5,,,,,,,,,,,,,,,,,,,,,,,,
70004337,,,,,,,,,,,,,,,,,,,,,,,,,,,,
70004649,,,,,,,,,,,,,,,,,,,,,,,,,,,,
70000792,,,,,,,,,,,,,,,,,,,,,,,,,,,,
70003620,,,,,,,,,,,,,,,,,,,,,,,,,,,,
70002844,,,,,,,,,,,,,,,,,,,,,,,,,,,,
70001038,,,,,,,,,,,,,,,,,,,,,,,,,,,,
70002496,,,,,,,,,,,,,,,,,,,,,,,,,,,,
70002711,,,,,,,,,,,,,,,,,,,,,,,,,,,,
70003656,,,,,,,,,,,,,,24,2,2,52.2,1,2,,,,104.4,2,1.5,,,
70002602,,,,,,,,,,,,,,,,,,,,,,,,,,,,
70004048,,,,,,,,,,,,,,,,,,,,,,,,,,,,
70005215,,,,,,,,,,,,,,,,,,,,,,,,,,,,
70002530,,,,,,,,,,,,,,,,,,,,,,,,,,,,
70000952,,,,,,,,,,,,,,,,,,,,,,,,,,,,
70000675,,,,,,,,240,1,6,,,,,,,,,,,,,,,,,,
70000168,,,,,,,,,,,,,,,,,,,,,,,,,,,,
70002993,,,,,,,,,,,,,,,,,,,,,,,,,,,,
70002619,,,,,,,,,,,,,,,,,,,,,,,,,,,,
70002553,,,,,,,,,,,,,,10,1,1,52.2,1,1,,,,,,,,,
70005050,,,,,,,,,,,,,,,,,,,,,,,,,,,,
70005091,,,,,,,,,,,,,,,,,,,,,,,,,,,,
70001694,,,,,,,,,,,,,,,,,,,,,,,,,,,,
70001045,,,,,,,,,,,,,,,,,,,,,,,,,,,,
70002653,,,,,,,,,,,,,,,,,,,,,,,,,,,,
70001083,,,,,,,,261,2,5,,,,,,,,,,,,,,,,,,
70001008,,,,,,,,,,,,,,,,,,,,,,,,,,,,
70004316,,52.2,2,3,,,,,,,,,,,,,,,,,,,,,,,,
70001777,,,,,,,,,,,,,,D,1,D,,,,,,,,,,,,
70002022,1,,,,,,,6,2,1,,,,4,2,1,,,,,,,,,,,,
70004590,,20,1,0.666666667,,,,,,,,,,,,,,,,,,,,,,104.4,1,0.5
70000625,,,,,,,,,,,,,,,,,,,,,,,,,,,,
70003698,,,,,,,,,,,,,,,,,,,,,,,,,,,,
70000371,,,,,,,,,,,,,,D,1,0.25,,,,,,,,,,,,
70001983,,,,,,,,,,,,,,,,,,,,,,,,,,,,
70003363,,,,,,,,,,,,,,,,,,,,,,,,,,,,
70002264,,,,,,,,,,,313.2,1,8,,,,,,,,,,,,,12,1,1
70004836,,,,,,,,,,,,,,,,,,,,,,,,,,,,
70003578,,,,,156.6,1,3,104.4,1,2,,,,,,,,,,,,,,,,,,
70005015,,,,,,,,,,,,,,,,,,,,,,,,,,,,
70002197,,,,,,,,,,,,,,,,,,,,,,,,,,,,
70003943,,,,,,,,,,,,,,,,,,,,,,,,,,,,
70001443,,,,,,,,,,,,,,,,,,,,,,,,,,,,
70000394,,,,,,,,,,,,,,,,,,,,,,,,,,,,
70005365,,,,,,,,,,,,,,,,,,,,,,,,,,,,
70002325,,,,,,,,,,,,,,24,2,1,,,,,,,,,,,,
70005238,,,,,,,,,,,,,,10,1,1,5,3,40,,,,,,,104.4,1,1
70003844,,,,,,,,,,,,,,,,,,,,,,,,,,,,
70004194,,,,,,,,,,,,,,D,1,D,,,,,,,,,,,,
70001222,,,,,,,,,,,,,,,,,,,,,,,,,,,,
70003314,,,,,,,,,,,,,,,,,,,,,,,,,,,,
70002375,,,,,,,,,,,,,,12,1,0.666666667,,,,,,,,,,,,
70001362,,,,,,,,,,,,,,,,,,,,,,,,,,,,
70004558,,,,,,,,,,,,,,,,,,,,,,,,,,,,
70004101,,,,,,,,,,,,,,,,,,,,,,,,,,,,
70002339,,,,,,,,,,,,,,,,,,,,,,,,,,,,
70004274,,,,,,,,,,,,,,,,,,,,,,,,,,,,
70003368,,,,,,,,,,,,,,,,,,,,,,,,,,,,
70005280,,,,,,,,,,,,,,,,,,,,,,,,,,,,
70002464,,,,,,,,,,,,,,1,1,1.5,,,,,,,,,,52.2,2,1
70000610,,,,,,,,,,,,,,,,,,,,,,,,,,,,
70003280,,,,,,,,,,,,,,2,1,2,4,4,2,,,,,,,,,
70003948,,24,2,1,,,,,,,,,,,,,,,,,,,,,,,,
70003664,,,,,,,,,,,,,,,,,,,,,,,,,,,,
70003579,,,,,,,,,,,360,1,5,,,,,,,,,,,,,,,
70002884,,,,,,,,,,,,,,261,1,5,,,,,,,,,,,,
70002025,,,,,,,,,,,,,,,,,,,,,,,,,,,,
70004394,,,,,,,,,,,,,,,,,,,,,,,,,,,,
70004630,,360,1,20,,,,,,,,,,3,2,0.25,20,3,2,,,,,,,,,
70003087,,,,,,,,,,,,,,,,,,,,,,,,,,,,
70004201,,,,,,,,,,,,,,,,,,,,,,,,,,,,
70005222,,,,,,,,,,,,,,10,1,0.5,,,,,,,,,,,,
70001839,,104.4,4,2,,,,,,,,,,,,,,,,,,,,,,,,
70000252,,,,,,,,,,,,,,,,,,,,,,,,,,,,