R4_Caseid_pub,R4_I1_I,R4_I2,R4_I3,R4_I4,R4_I5,R4_I6,R4_I7,R4_I8,R4_I9_I,R4_I10,R4_I11,R4_I12,R4_I17a_I,R4_I17b_I,R4_I18_I,R4_I19_I,R4_I21_I,R4_I22_I,R4_I23_I,R4_I25_I,R4_I26_I,R4_I29_I,R4_I30_I,R4_I31_I,R4_I32_1,R4_I32_2,R4_I33_I,R4_I34_I,R4_I35_I,R4_I36_I,R4_I37_I,R4_I38_I,R4_I39_I,R4_I40_I,R4_I41_I,R4_I42_I,R4_I43_I,R4_I44_I,R4_I45_i,R4_i46_i,R4_I47_i,R4_i48_i,R4_I49_i,R4_i50_i,R4_I51_i,R4_i52_i,R4_I53_i,R4_i54_i,R4_I55_i,R4_i56_i,R4_I57_i,R4_i58_i,R4_I59_I,R4_I60_I,R4_I61_I,R4_C_EquipFuncLim_I,R4_C_PCS8TOT_I,R4_C_MCS8TOT_I,R4_CageScore_indicator_i,R4_J8,R4_J10,R4_J11_1,R4_J11_2,R4_J11_7,R4_J11_8,R4_J11_9,R4_J11_10_PUB,R4_C_CurMedicare,R4_C_CurMedicaid,R4_C_CurMilInsur,R4_C_CurPrivEmp,R4_C_CurPrivSp,R4_C_CurPrivSelf,R4_C_CurOtherInsur,R4_C_CurNoInsur,R4_IncSource1_PUB,R4_IncSource2_PUB,R4_IncSource3_PUB,R4_IncSource4_PUB,R4_IncSource5_PUB,R4_IncSource6_PUB,R4_IncSource7_PUB,R4_C_LSTMNTHPAY_PUB,R4_C_TotGovCashBen_PUB,R4_C_TotNonCashBen_PUB,R4_L3_i_PUB,R4_L4_PUB,R4_L5_PUB,R4_L8_I_PUB,R4_L11_I_PUB,R4_L12_PUB,R4_L15,R4_L24_PUB,R4_c_cohab_i,R4_C_race_I_PUB,R4_c_bmi_cat_i,R4_C_HHSize_PUB,R4_C_NumChildHH_PUB,R4_C_NumOwnChildHH_PUB,R4_C_NumNonOwnChildHH_PUB,R4_C_NumOwnChildOHH_PUB,R4_C_NumOwnChild_PUB,R4_C_NumAdultHH_PUB,R4_C_FEDPOVERTYLEVEL_CAT1,R4_C_HHINC2009_PUB,R4_N_SSILASTMNTH_PUB,R4_N_SSDILASTMNTH_PUB,R4_N_DEPENLASTMNTH_PUB,R4_N_TotSSbenLastMnth_PUB,R4_N_BenAbsofEarn_atInt_PUB,R4_N_MCARE_ATINT,R4_N_MthsEarlEnt_PUB,R4_N_MthsRecEnt_PUB,R4_N_SSDI_atInt_PUB,R4_N_SSI_atInt_PUB,R4_N_TotSSbeN_atInt_PUB,R4_N_BENSTATATINT2,R4_N_SSDINOMCR_ATINT,R4_N_PIAatInt_PUB
70004109,5,4,5,3,4,5,4,3,5,1,0,0,0,,1,0,0,,,0,,1,0,0,,,0,,0,,0,,1,1,1,1,1,1,0,,0,,0,,0,,1,0,0,,0,,1,1,0,0,39.4,41.63,0,,0,,,,,,,1,0,0,0,0,0,0,0,0,0,0,0,0,0,1,0,1330,0,1,D,1,2,6,1,,4,0,5,4,1,0,0,0,0,0,1,3,D,0,1300,0,1300,1300,1,84,84,1300,0,1300,2,0,1300
70005058,3,1,1,3,2,1,1,1,3,1,0,0,0,,0,,0,,,0,,0,,,,,0,,0,,0,,0,,0,,0,,0,,0,,0,,0,,0,,0,,0,,0,0,0,0,60.31,67.69,0,,1,1,2,0,0,0,0,1,1,0,0,0,0,0,0,0,0,0,0,0,0,1,3,770,0,2,3,1,2,2,1,,,1,5,4,3,0,0,0,0,0,2,1,1,0,800,0,800,800,1,48,48,750,0,800,2,0,800
70000612,4,3,4,4,4,3,3,2,2,1,1,1,1,0,,,0,,,0,,1,0,1,1,2,1,1,0,,0,,0,,1,1,1,1,0,,1,0,0,,0,,0,,0,,0,,1,1,0,1,41.18,52.86,0,,1,0,2,7,0,0,0,1,0,0,1,0,0,0,0,0,0,0,1,0,0,1,0,1600,0,2,4,2,2,2,1,,,0,5,3,2,0,0,0,0,0,2,4,3,0,1300,0,1500,1500,1,78,72,1300,0,1500,2,0,1400
70002542,5,1,2,3,5,5,5,4,4,0,1,1,0,,0,,0,,,0,,0,,,,,0,,0,,0,,0,,1,1,0,,0,,1,1,1,0,1,0,1,1,1,1,0,,1,1,1,0,60.35,20.33,1,,1,1,0,0,8,0,0,0,1,0,0,1,0,0,0,0,0,0,0,0,0,1,0,640,0,1,1,1,2,2,1,,,0,5,4,3,1,0,1,0,0,2,7,5,600,0,0,600,600,0,54,54,0,650,600,1,0,0
70005196,4,3,4,5,3,3,2,1,3,0,0,0,0,,0,,0,,,0,,0,,,,,1,1,0,,0,,0,,0,,1,1,0,,0,,0,,0,,0,,0,,0,,1,0,0,0,37.11,63.84,0,,1,1,0,0,0,0,0,0,1,0,0,0,0,0,0,0,0,0,0,1,0,1,0,660,230,1,R,1,1,2,1,,,1,5,2,6,1,1,0,0,3,2,1,2,700,0,0,700,800,0,204,204,150,650,800,1,0,1100
70003431,3,5,5,3,4,3,1,2,3,1,0,1,1,0,,,0,,,0,,1,0,1,1,2,1,0,1,0,0,,0,,1,1,1,0,0,,0,,0,,0,,0,,0,,0,,0,0,0,1,32.6,68.4,0,,1,0,0,0,0,0,10,1,0,0,0,0,0,0,0,0,0,0,1,0,0,1,0,760,0,1,D,2,2,2,1,,D,0,5,2,4,0,0,0,0,0,2,2,D,0,800,0,800,800,1,174,138,750,0,800,2,0,800
70002769,3,3,4,3,4,4,4,4,3,1,1,0,0,,0,,0,,,1,1,0,,,,,0,,0,,0,,0,,0,,0,,1,0,1,1,0,,0,,1,1,1,1,0,,1,1,1,0,47.55,37.29,0,,1,1,0,0,0,0,0,0,1,0,0,0,0,0,0,0,0,0,0,0,0,1,0,850,D,3,1,1,2,2,1,,,1,5,2,2,0,0,0,0,0,2,3,2,800,0,0,800,800,0,126,126,0,800,800,1,0,0
70004497,5,4,5,5,3,R,5,4,4,1,1,1,1,1,,0,1,1,0,1,1,1,0,1,1,0,1,1,0,,0,,0,,1,1,1,1,0,,0,,1,0,0,,0,,0,,0,,1,1,1,1,37.76,37.35,0,,0,,,,,,,0,1,0,0,0,0,0,0,0,1,0,0,0,0,0,0,300,0,1,D,2,1,2,1,,,1,5,4,2,0,0,0,0,0,2,2,2,200,0,0,200,200,0,30,30,0,150,200,1,0,0
70002689,4,3,4,4,3,5,4,4,4,1,1,1,1,1,,0,0,,,0,,0,,,,,0,,0,,0,,0,,1,1,0,,0,,1,1,0,,0,,1,1,0,,0,,1,1,1,0,44.25,38.3,0,,0,,,,,,,0,1,0,0,0,0,0,0,0,0,0,0,0,0,1,0,860,0,2,4,4,2,2,1,,,0,5,3,2,0,0,0,0,0,2,6,4,800,0,0,900,900,0,361,241,0,800,900,1,0,0
70005171,2,1,1,1,1,1,1,1,3,0,0,0,0,,0,,0,,,0,,0,,,,,0,,0,,0,,0,,0,,0,,0,,0,,0,,0,,0,,0,,0,,0,0,0,0,66.68,69.19,0,,1,1,0,0,0,0,0,0,1,0,0,0,0,0,0,0,0,0,0,0,0,1,0,670,0,2,D,2,2,2,1,,4,0,7,2,2,0,0,0,0,0,2,3,D,700,0,0,700,700,0,186,186,0,650,700,1,0,0
70005031,4,4,2,5,4,3,3,4,4,1,0,0,0,,0,,1,1,0,0,,1,0,1,1,0,1,1,1,1,1,1,0,,1,1,1,1,0,,1,1,0,,0,,0,,0,,0,,0,1,0,1,43.9,45.55,0,,1,1,2,0,0,0,0,1,1,0,0,0,0,0,0,0,0,0,0,1,0,1,0,1410,200,2,D,D,2,2,1,,,0,7,3,4,1,1,0,0,2,2,2,2,0,1000,400,1400,1400,1,84,78,950,0,1400,2,0,1000
70003386,4,4,4,5,3,4,3,4,2,1,0,0,1,0,,,0,,,0,,1,0,1,1,0,1,1,1,0,0,,0,,1,1,1,0,1,0,1,1,0,,1,0,0,,1,0,0,,1,1,0,1,35.54,48.8,0,,1,0,2,0,8,0,0,1,0,0,0,1,0,0,0,1,0,0,0,0,0,1,0,1600,0,4,1,1,1,2,1,,,1,7,2,2,0,0,0,0,0,2,10,6,0,1300,0,1500,1500,0,36,36,1300,0,1500,2,1,1400
70002662,1,1,1,1,3,1,1,1,3,1,0,0,1,0,,,0,,,0,,0,,,,,0,,0,,0,,0,,0,,0,,0,,0,,0,,0,,0,,0,,0,,0,0,0,0,66.29,65.15,0,0,1,0,0,0,0,0,10,0,0,0,0,0,0,1,0,0,0,0,0,0,0,0,2,660,0,1,1,2,2,6,1,,D,0,5,2,2,0,0,0,0,0,2,1,D,0,600,0,700,700,1,361,241,600,50,700,3,0,600
70000795,4,4,4,1,4,3,1,1,3,1,1,1,1,1,,0,0,,,0,,1,1,0,,,0,,0,,0,,0,,0,,1,1,0,,1,1,0,,0,,1,1,1,1,0,,1,0,0,0,41.01,67.74,0,,1,1,2,0,0,0,0,1,1,0,0,0,0,0,0,0,0,0,0,0,0,1,0,1320,0,3,1,3,2,2,1,,5,0,5,3,3,0,0,0,3,3,2,3,D,0,900,400,1300,1300,1,144,144,900,0,1300,2,0,900
70000949,4,4,2,3,3,5,4,4,4,1,1,0,1,0,,,1,1,0,0,,1,0,0,,,0,,0,,0,,0,,0,,0,,0,,1,1,0,,1,0,1,1,1,1,0,,1,1,1,0,53.04,36.81,0,,1,1,0,0,0,0,0,0,1,0,0,0,0,0,0,0,0,0,0,0,0,1,0,850,0,1,1,1,2,2,1,,,0,7,4,4,1,0,2,0,0,2,2,2,800,0,0,800,800,0,126,126,0,800,800,1,0,0
70003895,4,4,4,4,5,4,5,4,4,1,1,1,0,,1,0,0,,,0,,0,,,,,1,1,1,1,1,1,0,,1,1,0,,0,,1,1,1,0,1,0,0,,0,,1,0,1,1,1,0,42.58,29.75,0,,1,1,0,0,0,0,0,0,1,0,0,0,0,0,0,0,0,0,0,1,0,1,0,670,230,2,D,2,2,2,1,,,0,5,2,5,1,D,D,0,D,2,2,2,700,0,0,700,700,0,162,162,0,650,700,1,0,0
70004771,3,1,3,4,3,1,2,1,3,1,0,0,1,1,,0,0,,,0,,0,,,,,0,,0,,1,1,0,,0,,0,,0,,0,,0,,0,,0,,0,,0,,0,0,0,0,51.22,62.62,0,,1,0,2,0,0,0,0,1,0,0,0,0,0,0,0,0,0,0,0,1,0,1,0,1600,230,2,1,1,1,2,1,,,1,5,4,4,1,1,0,0,2,2,4,5,0,1200,400,1500,1500,1,120,48,1150,0,1500,2,0,1200
70003061,4,2,4,5,4,4,5,4,4,1,1,1,1,0,,,0,,,0,,1,1,0,,,0,,0,,0,,0,,1,1,0,,0,,1,1,0,,0,,0,,0,,0,,1,1,1,0,45.96,28.48,0,,1,0,2,0,0,0,0,1,0,0,0,0,0,0,0,0,0,0,0,0,0,1,0,740,0,4,3,3,2,2,1,,6,0,5,4,2,0,0,0,0,0,2,5,D,0,700,0,700,1000,1,174,66,1000,0,1000,2,0,1000
70003879,3,1,1,2,3,3,3,3,2,0,1,1,1,0,,,0,,,0,,0,,,,,0,,0,,0,,0,,0,,0,,0,,0,,0,,0,,1,0,0,,0,,1,1,1,0,64.94,45.3,0,,1,1,0,0,0,0,0,0,1,0,0,0,0,0,0,0,0,0,0,1,0,1,0,790,200,1,D,1,2,6,1,,,0,5,4,1,0,0,0,3,3,1,2,1,800,0,0,800,800,0,48,48,0,800,800,1,0,0
70003881,3,2,2,3,4,2,3,1,2,1,0,0,0,,1,0,0,,,1,1,1,0,0,,,1,1,0,,0,,0,,0,,1,1,0,,1,1,0,,0,,1,1,1,1,0,,0,1,0,0,57.42,52.71,0,,1,0,2,0,0,0,0,1,0,0,0,0,0,0,0,0,0,0,0,0,0,1,D,930,0,2,2,3,2,6,1,,,0,7,4,2,0,0,0,0,0,2,2,1,0,900,0,900,900,1,361,228,950,0,900,2,0,900
70001975,3,4,4,5,4,5,5,4,5,1,1,1,1,1,,0,1,1,0,0,,1,0,1,1,0,1,0,0,,1,1,0,,1,1,1,1,0,,1,0,1,1,0,,1,0,0,,0,,0,1,0,1,41.98,30.93,0,1,0,,,,,,,0,0,0,0,0,0,0,1,0,0,0,0,0,0,1,0,1180,0,1,D,D,2,2,1,,D,1,5,4,3,0,0,0,0,0,2,3,D,0,1200,0,1200,1200,0,30,18,1200,0,1200,2,1,1200
70003792,4,4,4,5,4,4,3,4,3,1,0,0,1,0,,,0,,,0,,1,0,0,,,1,1,1,1,0,,0,,1,1,1,1,0,,0,,0,,0,,0,,0,,1,0,0,0,0,0,34.57,46.4,0,,1,1,2,0,0,0,0,1,1,0,0,0,0,0,0,0,0,0,0,1,0,1,0,690,200,3,D,3,2,2,1,,D,0,5,3,3,0,0,0,0,0,2,2,D,0,700,0,700,700,1,120,102,650,50,700,3,0,700
70004705,3,4,5,5,3,2,4,5,3,1,0,0,1,0,,,1,1,0,0,,1,0,1,1,0,1,1,0,,0,,0,,1,1,1,0,1,0,0,,1,0,0,,0,,0,,0,,0,1,0,1,37.4,44.25,0,,1,0,2,7,0,0,0,1,0,0,0,0,0,0,0,0,0,0,0,0,0,1,0,1600,0,2,2,3,1,2,1,,,1,5,3,2,0,0,0,0,0,2,9,6,0,1300,0,1500,1500,1,361,48,1300,0,1500,2,0,1400
70002400,2,1,1,1,1,1,2,1,3,0,1,0,1,0,,,0,,,1,1,0,,,,,0,,0,,0,,0,,0,,1,1,0,,0,,0,,0,,0,,0,,0,,0,0,0,0,68.79,64.02,0,,1,1,2,0,0,0,0,1,1,0,0,0,0,0,0,0,0,0,0,0,0,1,0,1070,0,2,4,4,2,2,1,,D,0,7,4,2,0,0,0,0,0,2,2,D,0,1100,0,1100,1100,1,361,241,1050,0,1100,2,0,1400
70003228,4,3,4,4,2,4,4,4,2,1,1,0,1,0,,,0,,,0,,0,,,,,0,,0,,0,,0,,0,,0,,0,,0,,0,,0,,0,,0,,0,,0,0,0,0,45.41,42.29,0,0,1,1,0,0,0,0,0,0,1,0,0,0,0,0,0,0,0,0,0,0,0,0,0,690,0,3,2,3,2,6,13,0,D,0,7,3,1,0,0,0,0,0,1,2,D,400,300,0,700,700,1,198,30,300,400,700,3,0,1200
70000442,2,1,4,1,2,3,2,3,3,0,1,0,0,,0,,0,,,1,1,0,,,,,0,,0,,0,,0,,0,,0,,0,,0,,0,,1,1,1,1,1,1,0,,1,1,0,0,54.79,58.19,0,,1,1,2,0,0,0,0,1,1,0,0,0,0,0,0,0,0,0,0,0,0,1,0,1000,0,2,1,2,2,2,1,,,0,5,1,3,0,0,0,0,0,2,5,4,0,1000,0,1000,1000,1,204,66,1000,0,1000,2,0,1400
70002866,2,2,2,4,2,1,2,2,1,1,0,0,1,0,,,0,,,0,,0,,,,,0,,0,,0,,0,,0,,0,,0,,0,,0,,0,,0,,0,,0,,0,1,0,0,55.65,62.68,0,,1,1,2,0,0,0,0,1,1,0,0,0,0,0,0,1,0,0,0,0,0,1,0,870,0,3,4,4,1,2,1,,,1,7,3,5,0,0,0,0,0,2,4,5,500,400,0,900,700,1,102,102,350,300,700,3,0,400
70001077,1,2,1,2,3,2,2,2,3,0,0,0,0,,0,,1,1,0,0,,0,,,,,1,1,0,,0,,0,,0,,1,1,0,,0,,0,,0,,0,,0,,0,,1,1,0,0,63.82,57.46,0,,1,0,2,0,0,0,0,1,0,0,0,0,0,0,0,0,0,0,0,0,0,1,2,750,0,2,4,4,2,2,1,,,0,5,3,3,0,0,0,0,0,2,3,3,0,700,0,700,800,1,258,241,750,0,800,2,0,800
70003809,6,5,5,5,5,5,5,3,5,1,1,1,1,1,,0,0,,,0,,1,0,0,,,1,0,1,0,0,,0,,1,1,1,0,1,1,1,0,0,,0,,1,1,1,0,1,0,1,1,0,0,31.45,34.06,0,,0,,,,,,,0,1,0,0,0,0,0,0,0,0,0,0,1,0,1,0,670,80,1,1,1,2,2,1,,1,0,5,4,4,1,1,1,0,1,2,1,D,700,0,0,700,700,0,162,162,0,650,700,1,0,0
70005080,5,4,5,6,5,4,5,5,4,1,0,0,0,,1,0,0,,,1,1,1,1,1,0,0,1,1,1,0,0,,1,1,1,1,1,0,0,,1,1,1,1,1,0,0,,0,,0,,1,0,0,1,33.56,27.93,0,,1,1,2,0,0,0,0,1,1,0,0,0,0,0,0,0,0,0,0,1,1,1,0,840,230,2,2,2,2,2,1,,3,0,5,1,2,0,0,0,0,0,2,2,D,0,800,0,800,800,1,204,102,850,0,800,2,0,800
70004786,2,2,2,1,1,3,2,2,2,0,0,0,1,0,,,1,1,1,1,1,0,,,,,0,,0,,0,,0,,0,,0,,0,,0,,0,,0,,0,,0,,0,,0,0,1,1,63.13,60.59,0,,0,,,,,,,1,0,0,0,0,0,0,0,0,0,0,0,1,0,1,4,580,230,2,2,1,2,2,1,,,1,5,3,5,1,1,0,0,3,2,3,4,0,600,0,600,900,1,348,180,900,0,900,2,0,900
70004471,4,4,4,4,3,3,3,2,4,1,0,0,1,0,,,0,,,0,,1,0,1,1,0,1,1,1,1,0,,0,,1,1,1,0,1,0,1,0,1,0,0,,0,,0,,0,,0,0,0,1,39.16,57.14,0,,1,0,0,0,8,0,0,0,0,0,0,1,0,0,0,0,0,0,0,0,0,1,0,510,0,1,D,2,1,2,1,,8,1,5,4,5,1,0,2,0,0,2,4,D,0,500,0,500,500,1,72,72,500,0,500,2,0,500
70003091,3,1,1,1,2,1,2,1,3,0,0,0,1,0,,,0,,,1,1,0,,,,,0,,0,,0,,0,,0,,0,,0,,0,,0,,0,,1,1,1,1,0,,1,1,1,0,66.87,62.19,0,,1,0,2,0,0,0,0,1,0,0,0,0,0,0,0,0,0,0,0,0,0,1,0,610,0,1,3,3,2,2,1,,,0,7,2,4,1,0,2,0,0,2,2,2,600,0,0,600,700,0,162,162,0,650,700,1,0,0
70000608,4,3,5,1,2,1,1,1,1,0,0,0,1,0,,,0,,,0,,0,,,,,0,,0,,0,,0,,0,,0,,0,,0,,0,,0,,0,,0,,0,,0,0,0,0,43.59,75.03,0,,1,1,2,0,0,0,0,1,0,0,0,0,0,0,0,0,0,0,0,0,0,1,2,0,0,2,3,D,2,2,1,,5,0,5,4,5,0,0,0,1,1,2,3,D,0,0,0,0,500,0,54,54,0,0,0,3,0,0
70001840,5,2,2,6,4,2,1,1,5,1,1,1,0,,1,0,0,,,0,,1,0,1,1,0,1,0,1,0,1,1,1,1,1,1,1,0,1,0,0,,1,0,0,,1,1,0,,0,,1,0,0,1,42.65,63.72,0,,0,,,,,,,1,1,0,0,0,0,0,0,0,0,0,0,1,0,1,0,500,70,1,D,D,2,6,1,,,0,7,3,1,0,0,0,0,0,1,2,1,500,0,0,500,600,0,282,241,0,550,600,1,0,0
70005108,2,1,1,1,3,3,3,2,1,0,1,1,1,0,,,0,,,0,,0,,,,,0,,0,,0,,0,,0,,0,,0,,0,,0,,0,,0,,0,,0,,1,1,1,0,69,48.22,0,,1,1,0,0,0,0,0,D,1,0,0,0,0,0,0,0,0,0,0,1,0,1,0,690,150,2,2,2,2,6,1,,,0,7,2,2,0,0,0,0,0,2,2,1,200,500,0,700,700,1,156,120,500,200,700,3,0,500
70002033,5,3,3,4,4,1,2,3,2,1,0,0,1,1,,0,1,1,1,1,1,1,0,0,,,1,1,1,1,1,1,1,1,1,1,1,1,0,,0,,0,,0,,0,,0,,1,0,1,1,0,1,42.71,56.96,0,,1,1,0,0,0,0,0,0,1,0,0,0,0,0,0,0,0,0,0,0,0,1,0,1120,0,2,D,D,1,2,1,,D,1,5,2,2,0,0,0,0,0,2,6,D,0,1100,0,1100,1100,0,30,30,1100,0,1100,2,1,1100
70001291,5,4,2,3,3,3,4,4,4,0,0,0,1,1,,0,1,1,0,1,1,1,0,1,0,2,1,1,0,,0,,1,1,1,1,0,,0,,0,,0,,0,,1,1,0,,0,,1,1,1,1,52.08,40.22,0,,1,1,2,0,0,0,0,1,1,0,0,1,0,0,0,0,0,0,0,0,0,1,0,80,0,1,D,D,2,6,1,,,0,7,2,1,0,0,0,0,0,1,2,1,100,0,0,100,100,0,198,198,0,150,100,1,0,0
70003583,3,2,2,3,3,1,2,1,3,1,1,0,1,0,,,0,,,0,,1,0,1,1,0,1,1,1,1,0,,0,,1,1,1,1,0,,0,,0,,0,,1,1,0,,0,,0,1,0,1,56.11,62.13,0,,1,0,2,0,8,0,0,0,1,0,0,1,0,0,0,0,0,0,0,0,0,1,0,300,0,2,4,1,2,2,1,,7,0,5,2,2,0,0,0,0,0,2,7,D,100,200,0,300,300,1,228,228,200,100,300,3,0,200
70000150,3,3,2,4,3,3,3,3,2,0,1,1,1,0,,,0,,,0,,0,,,,,0,,0,,0,,0,,1,1,0,,0,,1,1,0,,0,,0,,0,,0,,0,1,1,0,52.67,49.51,0,,1,0,0,0,8,0,0,1,0,0,0,1,0,0,0,0,0,0,0,0,0,1,0,1600,0,4,4,4,1,2,1,,8,1,5,2,3,1,1,0,0,1,2,7,D,0,1300,400,1500,1500,1,30,30,1300,0,1500,2,0,1400
70001904,1,5,1,3,2,1,2,1,3,1,0,0,0,,0,,0,,,1,0,1,0,1,0,2,1,0,1,0,1,0,1,0,1,0,1,0,1,1,1,1,1,1,1,1,1,1,1,1,1,1,0,0,0,1,55.07,69.24,0,,1,1,0,0,0,0,0,0,1,0,0,0,0,0,0,0,0,0,0,0,0,1,D,610,0,2,2,2,2,6,13,1,3,0,5,3,1,0,0,0,0,0,1,2,D,600,0,0,600,700,0,361,241,0,650,700,1,0,0
70005335,4,3,3,1,4,2,5,4,4,1,1,1,1,1,,0,0,,,0,,1,0,0,,,1,1,0,,0,,0,,1,1,0,,0,,1,1,0,,0,,0,,0,,0,,1,1,1,0,58.76,31.81,1,,1,1,2,0,0,0,0,1,1,0,0,0,0,0,0,0,0,0,0,1,1,1,0,870,40,2,2,2,2,6,1,,2,0,5,4,1,0,0,0,0,0,1,1,D,0,900,0,900,900,1,258,36,850,0,900,2,0,900
70000683,4,3,3,4,3,4,4,4,3,1,1,1,1,0,,,0,,,0,,0,,,,,0,,0,,0,,0,,1,1,0,,0,,0,,0,,0,,1,0,0,,0,,1,1,0,0,49.46,37.83,0,,1,0,2,0,0,0,0,1,0,0,0,0,0,0,0,0,0,0,1,0,0,1,0,970,0,3,4,4,2,6,1,,,0,5,3,4,1,1,0,2,3,2,2,2,0,1000,0,1000,1000,1,108,96,950,0,1000,2,0,1000
70001288,4,4,4,5,5,4,5,5,5,1,1,1,1,1,,0,1,1,0,0,,1,0,0,,,1,1,1,1,1,1,0,,1,1,1,1,0,,0,,1,1,1,0,0,,0,,0,,1,1,0,0,39.4,27.09,0,,0,,,,,,,0,1,0,0,0,0,0,0,0,0,0,0,0,0,1,0,850,0,1,D,1,1,2,1,,D,1,5,3,4,1,1,0,0,2,2,3,D,800,0,0,800,800,0,66,66,0,800,800,1,0,0
70000687,3,4,3,4,3,2,5,4,2,1,1,1,1,0,,,0,,,0,,0,,,,,0,,0,,1,1,0,,0,,0,,0,,0,,0,,0,,0,,0,,0,,1,1,0,0,51.32,36.9,0,,0,,,,,,,1,1,0,0,0,0,0,0,0,0,0,0,0,0,1,0,980,0,3,4,3,1,2,1,,1,1,5,2,4,1,1,0,0,2,2,1,D,0,800,120,1000,1200,1,144,138,800,50,1200,3,0,800
70001969,3,1,2,3,4,1,4,1,3,0,0,0,0,,1,0,1,1,0,0,,0,,,,,0,,0,,0,,0,,1,1,1,1,0,,0,,0,,0,,0,,1,1,0,,1,1,1,0,62.14,45.72,0,1,0,,,,,,,0,0,0,0,0,0,0,1,0,0,0,0,0,0,0,0,0,0,1,D,D,2,2,1,,1,0,7,2,3,1,0,2,0,0,1,1,D,0,0,0,0,0,0,180,180,0,0,0,1,0,0
70004045,1,1,1,1,1,2,5,2,3,1,1,1,0,,1,0,0,,,1,1,0,,,,,0,,0,,0,,0,,0,,0,,0,,0,,0,,0,,0,,1,1,0,,1,1,1,0,78.04,40.21,0,,1,1,2,0,0,0,0,1,0,0,0,0,0,0,0,0,0,0,0,1,0,1,0,670,90,2,4,4,2,6,13,1,,0,5,2,1,0,0,0,0,0,1,2,1,700,0,0,700,700,0,330,241,0,650,700,1,0,0
70004123,2,3,3,4,2,1,3,2,4,0,0,0,0,,0,,0,,,0,,0,,,,,0,,0,,1,1,0,,1,1,1,1,0,,0,,0,,0,,0,,0,,0,,1,1,0,0,51.42,59.87,0,,0,,,,,,,1,D,0,0,0,0,0,0,0,0,0,0,0,0,1,0,420,0,1,D,1,2,2,1,,,0,7,3,6,1,0,3,0,0,2,1,1,400,0,0,400,0,0,138,138,0,0,0,1,0,0
70001395,3,3,3,3,3,3,3,3,3,0,1,0,0,,0,,0,,,0,,0,,,,,0,,0,,0,,0,,0,,0,,0,,0,,0,,0,,1,1,0,,0,,1,1,0,0,51.2,50.72,0,,0,,,,,,,0,1,0,0,0,0,0,0,0,0,0,0,1,0,1,0,670,80,1,1,1,2,6,13,0,,0,5,4,1,0,0,0,3,3,1,2,1,700,0,0,700,700,0,180,180,0,650,700,1,0,0
70003737,4,4,3,2,5,2,1,1,3,1,0,0,1,1,,0,0,,,0,,0,,,,,1,0,0,,0,,1,0,1,1,0,,0,,0,,0,,0,,0,,0,,0,,1,1,1,0,42.94,66.12,0,,0,,,,,,,1,1,0,0,0,0,0,0,0,0,0,0,0,0,1,0,700,0,2,2,2,2,6,1,,,0,5,3,1,0,0,0,0,0,1,1,1,0,700,0,700,700,1,72,66,700,0,700,2,0,700
70004103,5,4,4,4,4,3,3,3,3,1,1,0,0,,0,,0,,,0,,1,0,1,1,0,1,0,1,0,0,,0,,1,1,1,1,0,,1,0,0,,0,,0,,0,,0,,0,0,0,1,36.76,51.65,0,,1,0,2,0,8,0,0,1,1,0,0,1,0,0,0,0,0,0,0,0,0,1,0,900,0,3,2,4,2,2,1,,,0,7,3,3,1,1,0,0,1,2,5,4,0,900,0,900,900,1,78,78,900,0,900,2,0,900
70003082,3,2,2,3,3,2,2,3,3,0,0,0,0,,1,0,0,,,0,,0,,,,,1,0,0,,1,1,1,1,0,,1,1,0,,1,0,1,0,0,,1,1,0,,0,,1,1,0,0,55.53,55.46,0,,1,1,0,0,0,0,0,0,1,0,0,0,0,0,0,0,1,0,0,1,0,1,0,830,230,1,D,1,2,2,1,,3,0,7,3,3,1,D,D,0,D,2,1,D,400,300,0,700,700,1,361,204,300,400,700,3,0,400
70001020,4,3,5,4,3,4,4,4,2,1,1,1,1,1,,0,0,,,1,1,1,0,1,0,0,0,,0,,1,1,1,1,1,1,1,1,0,,1,1,0,,1,1,1,1,1,1,1,0,1,1,1,1,41.71,40.5,0,,1,1,2,0,0,0,0,1,0,0,0,0,0,0,0,0,0,0,0,0,0,1,0,760,0,2,1,1,2,2,1,,,0,7,2,5,0,0,0,0,0,2,3,4,0,800,0,800,800,1,342,30,750,0,800,2,0,1400
70003407,1,1,1,1,1,1,1,1,3,0,0,0,1,0,,,0,,,0,,0,,,,,0,,0,,0,,0,,0,,0,,0,,0,,0,,0,,0,,0,,0,,0,0,0,0,68.01,69.43,0,,1,1,0,0,0,0,0,D,1,0,0,0,0,0,0,0,0,0,0,0,0,1,2,670,0,2,4,4,2,2,1,,,0,5,2,2,0,0,0,0,0,2,10,6,0,700,0,700,800,1,198,54,650,0,700,2,0,700
70004258,5,5,4,6,3,4,2,1,5,0,0,0,0,,1,0,0,,,0,,1,0,1,0,0,1,1,1,1,0,,1,1,1,1,1,1,0,,1,1,1,1,1,1,1,1,1,1,0,,1,1,1,1,28.07,65.03,0,,1,1,2,0,0,0,0,1,1,0,0,0,0,0,0,0,0,0,0,1,0,1,0,690,D,1,2,1,1,2,1,,4,1,5,3,5,1,1,0,0,3,2,2,D,500,200,0,700,500,1,174,174,200,250,500,3,0,200
70000634,4,2,4,4,4,2,2,2,2,1,0,0,0,,0,,0,,,0,,0,,,,,0,,1,0,1,1,0,,0,,0,,0,,0,,0,,0,,0,,0,,0,,0,1,0,0,41.46,59,0,,1,1,2,0,0,0,0,1,1,0,0,0,0,0,0,0,0,0,0,1,1,1,0,760,230,2,D,D,2,6,1,,,0,5,2,1,0,0,0,0,0,1,2,1,800,0,0,800,800,1,270,241,0,750,800,1,0,0
70005369,5,3,3,5,4,3,4,2,4,1,0,0,1,0,,,0,,,1,1,1,1,1,1,0,0,,1,1,1,0,1,1,1,1,1,1,1,0,0,,1,0,1,1,0,,1,1,0,,1,1,0,1,45.12,43.98,0,,1,0,2,0,0,9,0,1,0,0,0,0,1,0,0,0,0,0,0,0,0,1,0,1370,0,2,1,1,1,2,1,,,1,5,3,4,1,1,0,0,2,2,3,3,0,900,400,1400,1400,1,132,120,900,0,1400,2,0,900
70003476,5,3,4,4,4,4,2,2,3,1,0,0,1,1,,0,0,,,0,,1,1,0,,,1,1,0,,0,,1,1,1,1,1,1,1,0,0,,1,0,0,,0,,0,,0,,1,0,0,0,37.52,56.12,0,,1,0,2,0,0,0,0,1,0,0,0,0,0,0,0,0,0,0,0,0,0,1,0,1100,0,1,2,1,2,6,1,,3,0,5,4,1,0,0,0,0,0,1,2,R,0,1100,0,1100,1100,1,186,186,1100,0,1100,2,0,1100
70003880,5,3,3,5,4,2,3,2,3,1,0,0,1,1,,0,0,,,0,,1,0,0,,,1,0,1,1,0,,0,,1,1,1,1,0,,0,,0,,0,,0,,0,,0,,0,0,0,0,42.34,53.03,0,,1,1,0,0,0,0,0,0,1,0,0,0,0,0,0,0,1,0,0,1,0,1,0,1050,230,1,1,2,1,2,1,,,0,7,2,5,1,0,2,0,0,2,1,1,700,0,0,700,700,0,300,241,0,650,700,1,0,0
70003554,3,1,1,4,3,3,3,2,3,0,1,0,1,0,,,0,,,0,,0,,,,,0,,0,,0,,0,,0,,0,,0,,0,,0,,0,,0,,0,,0,,0,0,0,0,60.69,48.5,0,,1,1,2,0,0,0,0,1,1,0,0,0,0,0,0,0,0,0,0,1,0,1,0,190,110,2,2,2,2,2,1,,4,0,5,2,5,1,0,2,0,0,2,2,D,0,200,0,200,200,1,216,204,200,0,200,2,0,200
70002876,2,1,1,2,3,1,1,1,3,1,0,0,1,0,,,0,,,0,,0,,,,,0,,0,,0,,0,,1,1,1,0,0,,0,,0,,0,,0,,0,,0,,0,0,0,0,62.45,65.09,0,,1,1,0,0,0,0,0,0,1,0,0,0,0,0,0,0,0,0,0,1,0,0,D,0,230,3,2,4,2,2,1,,1,0,7,4,3,1,1,0,0,2,1,1,D,0,0,0,0,0,0,204,204,0,0,0,1,0,0
70004911,5,4,4,4,4,3,4,4,3,0,0,0,1,0,,,0,,,0,,1,1,1,1,0,1,1,1,1,0,,0,,1,1,0,,0,,1,1,1,1,1,1,1,1,1,1,0,,1,1,1,1,39.35,41.17,0,,0,,,,,,,1,1,0,0,0,0,0,0,0,0,0,0,1,0,0,0,690,140,1,1,1,2,6,1,,2,0,5,3,1,0,0,0,0,0,1,1,R,300,400,0,700,700,1,270,66,400,300,700,3,0,400
70000296,4,4,4,5,4,4,5,4,5,1,1,1,1,1,,0,0,,,0,,1,0,1,1,0,1,1,1,1,0,,0,,1,1,1,0,1,1,1,1,1,1,1,1,0,,1,0,1,0,1,1,1,1,40.45,31.94,0,,1,0,2,0,0,0,10,1,0,1,0,0,0,0,0,0,1,0,0,0,0,1,0,1600,0,3,2,2,2,2,1,,,1,5,4,2,0,0,0,0,0,2,4,3,0,600,0,600,600,1,162,138,600,0,600,2,0,600
70003931,1,1,1,3,1,1,1,1,1,0,0,0,1,0,,,0,,,0,,0,,,,,0,,0,,0,,1,1,0,,0,,0,,1,0,0,,0,,0,,0,,0,,0,0,0,0,63.56,69.76,0,,1,1,0,0,0,0,0,0,1,0,0,0,0,0,0,0,0,0,0,1,0,1,0,790,D,2,1,D,2,6,1,,D,0,5,4,1,0,0,0,0,0,1,2,D,800,0,0,800,800,0,258,241,0,800,800,1,0,1000
70001233,4,3,5,5,3,2,3,3,4,1,1,0,1,0,,,1,1,0,0,,0,,,,,0,,0,,1,1,0,,1,1,0,,0,,0,,0,,0,,0,,0,,0,,0,1,0,0,36.45,55.44,0,,1,0,2,0,0,0,0,1,0,0,0,0,0,0,0,0,1,0,0,1,0,1,0,1600,20,3,2,2,2,6,1,,,0,5,4,1,0,0,0,1,1,1,3,2,0,1000,400,1500,1500,1,306,102,1150,0,1500,2,0,1100
70000880,1,2,2,4,3,3,3,3,3,1,0,0,1,1,,0,0,,,1,1,0,,,,,1,1,0,,0,,0,,0,,0,,0,,1,1,0,,0,,1,1,1,1,0,,1,1,1,0,57.8,48.4,0,,1,1,0,7,0,0,0,0,1,0,1,0,0,0,0,0,0,0,0,0,0,0,4,0,0,5,2,1,2,2,1,,,0,5,4,3,0,0,0,0,0,2,5,4,0,0,0,0,800,0,198,90,350,0,300,1,0,300
70001460,6,1,1,6,4,4,3,3,4,1,0,0,1,1,,0,0,,,0,,1,0,0,,,1,0,1,0,1,1,1,0,1,1,1,0,0,,1,0,1,1,0,,1,1,1,1,0,,1,0,0,0,49.64,40.42,0,,1,0,2,0,0,9,0,1,0,0,0,0,1,0,0,1,0,0,0,0,0,1,0,840,0,2,D,1,1,2,1,,,1,5,4,4,0,0,0,0,0,2,4,4,0,800,0,800,800,1,192,192,850,0,800,2,0,800
70003721,5,3,2,4,4,4,3,1,2,1,1,1,1,0,,,0,,,0,,0,,,,,1,1,0,,0,,1,1,0,,1,1,0,,1,0,0,,0,,1,1,0,,0,,1,1,1,0,49.29,49.73,0,,1,1,0,0,0,0,0,0,1,0,0,0,0,0,0,0,0,0,0,1,1,1,0,670,230,2,D,4,2,2,1,,,1,5,3,2,0,0,0,0,0,2,2,1,700,0,0,700,700,0,174,174,0,650,700,1,0,0
70003944,5,4,4,5,5,4,2,1,5,1,0,0,1,0,,,0,,,0,,1,0,1,1,2,1,1,1,0,0,,1,0,1,1,1,0,1,0,1,1,1,1,1,1,0,,1,0,1,0,0,0,0,1,31.06,58.8,0,,1,0,2,0,0,9,0,1,0,0,0,0,1,0,0,0,0,0,0,1,0,1,0,610,90,4,2,3,2,6,1,,,0,5,4,2,0,0,0,0,0,2,3,2,0,600,0,600,600,1,138,132,600,0,600,2,0,600
70004586,4,5,4,1,2,4,1,1,4,0,0,0,0,,0,,0,,,0,,1,0,1,0,2,1,1,1,0,0,,1,0,1,1,0,,0,,1,1,0,,0,,0,,0,,0,,0,0,0,1,40.21,72.21,0,,1,1,0,0,0,0,0,0,1,0,0,0,0,0,0,0,0,0,0,1,0,1,0,670,230,1,2,1,2,2,1,,,1,5,2,5,1,1,0,0,3,2,1,1,700,0,0,700,700,0,186,186,0,650,700,1,0,0
70000280,4,4,4,3,3,3,4,4,3,0,0,0,0,,1,0,0,,,0,,0,,,,,0,,0,,0,,0,,0,,0,,0,,1,1,0,,0,,1,1,1,1,0,,1,1,1,0,44.06,43.6,0,,1,0,2,0,0,0,0,1,1,D,0,0,0,0,0,0,0,0,0,0,0,1,0,670,0,2,1,2,2,2,1,,D,0,7,1,2,0,0,0,0,0,2,5,D,700,0,0,700,700,0,198,198,0,650,700,1,0,0
70003261,6,3,3,4,3,4,4,3,5,1,1,1,1,1,,0,0,,,0,,1,1,0,,,1,1,0,,0,,0,,1,1,1,1,0,,1,1,0,,0,,1,1,0,,0,,1,1,0,0,46.65,40.62,0,0,1,0,0,0,0,0,10,0,0,0,0,0,0,1,0,0,1,0,0,1,0,1,0,730,D,1,D,1,2,6,13,1,D,0,7,3,1,0,0,0,0,0,1,2,D,700,0,0,700,700,0,361,241,0,650,700,1,0,0
70002531,5,5,4,5,4,5,3,3,4,1,1,0,1,0,,,0,,,0,,1,0,1,1,0,1,1,1,0,1,0,1,1,1,0,1,1,1,0,1,1,1,0,0,,0,,0,,1,0,1,0,0,1,30.93,49.95,0,,1,1,2,0,0,0,0,1,1,0,0,0,0,0,0,0,0,0,0,1,0,1,0,680,200,1,1,D,2,6,1,,,0,5,4,1,0,0,0,0,0,1,2,1,200,500,0,700,700,1,156,144,450,200,700,3,0,500
70001126,3,4,4,5,3,3,5,3,3,0,0,0,0,,0,,0,,,0,,1,0,1,1,0,1,1,1,1,0,,0,,1,1,1,0,1,1,1,0,1,1,0,,0,,0,,0,,1,1,1,1,43.46,40.31,0,,1,1,0,0,0,0,0,0,1,0,0,0,0,0,0,0,0,0,0,1,1,1,0,670,230,1,3,1,1,2,1,,,1,5,4,4,1,1,0,0,2,2,1,1,700,0,0,700,700,0,120,120,0,650,700,1,0,0
70005362,3,1,1,2,2,1,1,1,3,1,1,1,1,0,,,0,,,0,,0,,,,,0,,0,,0,,0,,0,,0,,0,,0,,0,,0,,0,,0,,0,,0,1,0,0,62.24,67.55,0,,1,1,2,0,0,0,0,1,1,0,0,0,0,0,0,0,0,0,0,1,0,1,0,890,140,2,D,1,1,2,1,,,1,5,3,4,0,0,0,0,0,2,2,2,0,900,0,900,900,1,90,84,900,0,900,2,0,900
70004086,4,5,5,3,4,5,4,5,4,1,0,1,1,0,,,1,1,0,0,,1,0,0,,,1,1,1,0,0,,1,1,1,1,1,1,0,,0,,0,,0,,0,,1,1,0,,1,1,1,0,37.3,37.3,0,,1,0,2,7,0,0,0,1,0,0,1,0,0,0,0,0,0,0,0,0,0,1,0,1600,0,4,2,2,1,2,1,,D,1,5,2,2,0,0,0,0,0,2,7,D,0,1300,0,1500,1500,0,204,204,1300,0,1500,2,1,1400
70000774,4,1,1,6,4,2,3,1,3,0,0,0,0,,1,0,0,,,0,,1,1,0,,,1,0,1,0,0,,0,,1,1,1,1,0,,1,0,0,,1,1,1,1,1,1,0,,1,1,1,0,53.51,50.67,0,,1,1,0,0,0,0,0,1,1,0,0,0,0,0,0,0,0,0,0,0,0,1,0,620,0,2,D,D,2,2,1,,4,0,5,4,6,1,0,2,0,0,2,2,D,600,0,0,600,800,0,180,180,0,800,800,1,0,0
70004295,1,4,3,4,3,3,1,1,3,1,0,0,1,0,,,0,,,0,,0,,,,,0,,0,,0,,0,,0,,0,,0,,0,,0,,0,,0,,0,,0,,0,0,1,0,44.28,69.66,0,0,1,1,0,0,0,0,0,0,1,0,0,0,0,0,0,0,0,0,0,1,0,1,0,670,200,2,1,1,1,2,1,,D,1,5,2,6,1,0,2,0,0,2,1,D,700,0,0,700,700,0,186,186,0,650,700,1,0,0
70001112,5,3,3,4,3,4,5,4,4,1,1,D,1,0,,,0,,,0,,0,,,,,0,,0,,0,,0,,0,,1,1,0,,0,,0,,0,,1,1,1,1,0,,1,1,1,0,51.27,30.27,0,D,1,1,0,0,0,0,0,D,D,D,D,D,D,D,2,0,0,0,0,0,0,0,0,670,D,2,D,D,2,2,1,,D,0,5,2,6,1,0,3,0,0,2,3,D,700,0,0,700,700,0,192,192,0,650,700,1,0,0
70003211,4,4,5,5,4,5,4,5,3,1,1,1,0,,0,,0,,,0,,1,0,1,1,0,1,0,1,0,1,0,1,0,1,1,1,0,0,,1,1,0,,0,,1,1,1,1,0,,1,1,1,1,34.5,36.01,0,,1,1,2,0,0,0,0,1,1,0,0,0,0,0,0,0,0,0,1,0,0,1,0,1600,0,2,2,2,1,2,1,,6,1,5,4,4,1,1,0,0,2,2,3,D,0,1300,400,1500,1500,1,42,30,1300,0,1500,2,0,1300
70001027,4,2,2,2,3,2,2,2,2,1,0,0,1,0,,,0,,,0,,1,1,0,,,0,,0,,0,,0,,1,1,1,1,0,,0,,0,,0,,0,,0,,0,,0,0,0,0,56.12,57.9,0,,1,0,2,0,0,0,0,1,1,0,0,0,0,0,0,0,0,0,0,0,0,0,0,610,0,2,2,2,2,2,1,,3,1,7,3,6,1,1,0,3,3,2,1,D,600,0,0,600,700,1,198,198,0,650,700,1,0,0
70004219,3,1,1,1,3,3,1,2,2,1,1,1,1,0,,,0,,,0,,0,,,,,0,,0,,0,,0,,0,,0,,0,,0,,0,,0,,0,,0,,0,,0,0,0,0,63.26,58.95,0,,1,1,0,0,0,0,0,0,1,0,0,0,0,0,0,0,0,0,0,0,0,0,4,0,0,3,1,1,1,2,1,,,1,7,3,3,0,0,0,0,0,2,4,4,0,0,0,0,900,0,150,150,0,0,0,1,0,0
70001060,4,3,2,3,2,1,1,3,4,1,1,1,1,0,,,0,,,0,,1,0,1,0,0,0,,0,,0,,0,,1,1,0,,0,,1,0,0,,0,,1,1,0,,0,,1,0,0,1,50.45,65.85,0,,1,1,2,0,0,0,0,1,1,0,0,0,0,0,0,0,0,0,0,1,1,1,0,630,D,2,D,D,2,6,1,,D,0,5,4,1,0,0,0,0,0,1,2,D,100,500,0,600,700,1,306,168,500,200,700,3,0,600
70000664,4,4,3,4,3,4,3,3,4,1,0,0,1,1,,0,1,1,0,1,1,1,1,1,1,0,0,,0,,1,1,1,1,1,1,1,1,0,,0,,1,0,0,,0,,0,,1,0,0,1,1,1,43.89,50.18,0,,0,,,,,,,1,0,1,0,0,0,0,0,0,0,0,0,1,1,1,0,960,230,3,1,1,2,6,1,,,0,7,3,1,0,0,0,0,0,1,3,2,0,1000,0,1000,1100,1,210,84,1100,0,1100,2,0,1100
70001761,5,4,4,5,4,3,4,3,3,1,0,0,1,0,,,0,,,0,,1,0,1,1,0,1,1,1,1,0,,1,1,1,1,1,1,0,,0,,1,0,1,0,0,,0,,0,,1,1,0,1,36.74,44.74,0,,1,0,0,0,8,0,0,1,0,0,0,1,0,0,0,0,0,0,0,0,0,1,0,940,0,1,D,D,1,2,1,,,1,5,4,3,0,0,0,0,0,2,8,6,0,900,0,900,900,1,126,126,950,0,900,2,0,900
70004624,5,3,4,5,5,4,4,4,4,1,0,0,1,1,,0,0,,,0,,1,0,1,0,0,1,1,1,1,1,0,1,0,1,1,1,1,0,,1,1,1,1,1,1,1,1,1,1,0,,1,1,0,1,38.49,35.23,0,,1,0,2,0,0,0,0,1,0,0,0,0,0,0,0,0,0,0,0,0,0,1,0,940,0,3,2,2,1,2,1,,4,1,5,2,3,1,0,1,0,0,2,2,D,0,900,0,900,900,1,180,180,950,0,900,2,0,900
70000026,6,5,5,6,5,5,5,5,2,1,1,1,1,1,,1,1,0,0,0,,1,0,1,1,0,1,0,1,0,1,0,1,1,1,1,1,1,1,1,1,1,1,1,0,,1,1,1,1,1,0,1,1,1,1,28.83,27.98,0,,1,1,2,0,0,0,0,1,1,0,0,0,0,0,0,0,1,0,0,1,0,1,0,700,40,1,D,2,2,6,1,,2,0,5,4,1,0,0,0,2,2,1,1,D,200,500,0,700,700,1,90,84,500,200,700,3,0,500